{"text_format":"1","workbook":"xlsx","n_sheets":3,"sheets":["骨密度","郵便番号","設定リスト"],"not_rendered":{"charts":0,"images":0,"macros":1,"external_links":1,"defined_names":4,"comments":0,"pivot_tables":0},"unopened":[],"bounds":{"document_bytes":16777216,"sheet_cells":100000,"rows_first":2000,"rows_last":500,"rows_between":2000,"halvings":0,"cell_chars":16384,"cell_head_chars":4096},"cells_cut":0,"cells_raw":0,"read":"whole","date_system":"1900"}

{"sheet":"骨密度","index":0,"n_rows":93,"n_cols":11,"rows_kept":93,"cut":false,"hidden":false,"merged":[[0,3,0,4],[46,3,46,10],[47,4,47,6],[48,4,48,8],[48,9,48,10],[41,4,41,10],[25,6,25,7],[20,6,20,7],[26,6,26,7],[26,8,26,10],[18,3,18,10],[19,3,19,10],[21,6,21,7],[22,6,22,7],[23,6,23,7],[17,3,17,10],[9,3,9,10],[12,6,12,7],[12,8,12,10],[14,9,14,10],[15,3,15,10],[10,6,10,7],[10,8,10,10],[12,4,12,5],[11,6,11,7],[11,8,11,10],[11,4,11,5],[5,4,5,6],[5,8,5,10],[7,5,7,10],[8,4,8,5],[8,6,8,7],[8,8,8,10],[6,9,6,10],[6,4,6,6],[2,4,2,6],[2,8,2,10],[3,4,3,8],[3,9,3,10],[4,4,4,6],[4,8,4,10]]}
[null,"入力欄",null,"　  印刷確認用\n▽入力はできません",null,"検査案内",null,null,"入力欄"]
["医療機関名",null,null,"柏崎総合医療センター ",null,"骨密度","共同利用申込書  兼  診療情報提供書"]
["医師名",{"$f":"IFERROR(VLOOKUP($B$2,設定リスト!A2:B27,2,FALSE),\"\")","v":""},null,"医療機関名",{"$f":"$B$2","v":0},null,null,"医師名",{"$f":"$B$3","v":""}]
["予約日",null,"例) 2022/6/1 入力 or プルダウンから選択","予約日時",{"$f":"IF($B$4=\"\",\"　　年　　　月　　　日　　　曜日\",$B$4)","v":"　　年　　　月　　　日　　　曜日"},null,null,null,null,{"$f":"IF($B$5=\"\",\":\",$B$5)","v":":"}]
["予約時刻",null,"例) 15:00  入力 or プルダウンから選択","フリガナ",{"$f":"IF($B$7=\"\",\"\",$B$7)","v":""},null,null,"生年月日",{"$f":"IF($B$9=\"\",\"　　年　　　月　　　日\",$B$9)","v":"　　年　　　月　　　日"}]
["患者名",null,null,"患者氏名",{"$f":"IF($B$6=\"\",\"\",$B$6)","v":""},null,null,"検査時年齢",{"$f":"IF(B9=\"\",0,YEAR(B4)-YEAR(B9)+IF(B4<DATE(YEAR(B4),MONTH(B9),DAY(B9)),-1,0))","v":0}]
["フリガナ",{"$f":"PHONETIC($B$6)","v":""},"お間違いないか確認してください","性別",{"$f":"IF(B8=\"\",\"男性　　　女性\",IF(OR(B8={1,\"男性\"}),\"男性　  　　\",\"　  　　女性\"))","v":"男性　　　女性"},null,null,"身長・体重",{"$f":"IF($B$10=\"\",\"cm\",$B$10)","v":"cm"},{"$f":"IF(B11=\"\",\"  .   Kg\",$B$11)","v":"  .   Kg"}]
["性別",null,{"$f":"IF(B8=\"\",\"1：男性　　2：女性　　数字入力　または　選択\",IF(OR(B8={1,\"男性\"}),\"男性\",\"女性\"))","v":"1：男性　　2：女性　　数字入力　または　選択"},"住所",{"$f":"$B$12","v":0},{"$f":"B13&\" \"&B14","v":" "}]
["生年月日",null,{"$f":"IF($I$6=0,\"例) 1991/6/1  　　西暦で入力\",$I$6&\"  歳\")","v":"例) 1991/6/1  　　西暦で入力"},"電話番号",{"$f":"$B$15","v":0},null,"当院受診歴",null,{"$f":"IF(B16=\"\",\"有り  ・  なし\",IF(OR(B16={1,\"有り\"}),\"有り　　　\",\"　　　なし\"))","v":"有り  ・  なし"}]
["身長　[ cm ]",null,"例)  170   　　　    数字のみ入力","保険証 および 公費等医療証 をご提供いただく場合、保険情報の記入は不要です"]
["体重  [ kg ]",null,"例)  65               数字のみ入力","保険証記号・番号",{"$f":"$B$17","v":0},{"$f":"$B$18","v":0},"医療証負担者番号",null,{"$f":"$B$22","v":0}]
["郵便番号",null,"例)  9450035   　 数字のみ入力、ハイフンなし","保険者番号",{"$f":"$B$19","v":0},null,"医療証受給者番号",null,{"$f":"$B$23","v":0}]
["市区町村",{"$f":"$A$31","v":""},"お間違いないか確認してください","被保険者区分",{"$f":"IF(B20=\"\",\"本人　　　家族\",IF(OR(B20={1,\"本人\"}),\"本人　  　　\",\"　  　　家族\"))","v":"本人　　　家族"},null,"負担割合",null,{"$f":"$B$21","v":0}]
["番地・建物名",null,null,{"$f":"$F$2","v":"骨密度"},null,null,{"$f":"$F$2","v":"骨密度"},null,null,null,{"$f":"$F$2","v":"骨密度"}]
["電話番号",null,"例)  0256-23-2165","臨床診断",null,null,null,null,null,"必ずご記入ください"]
["当院受診歴",null,{"$f":"IF(B16=\"\",\"1：有り　  2：なし　　数字入力　または　選択\",IF(OR(B16={1,\"有り\"}),\"有り\",\"なし\"))","v":"1：有り　  2：なし　　数字入力　または　選択"},{"$f":"$B$24","v":0}]
["保険証　記号",null,"キゴウ","検査目的"]
["保険証　番号",null,"バンゴウ",{"$f":"B25","v":0}]
["保険者番号",null,null,{"$f":"B26","v":0}]
["被保険者区分",null,{"$f":"IF(B20=\"\",\" 1：本人　  2：家族　　数字入力　または　選択\",IF(OR(B20={1,\"本人\"}),\"1：本人\",\"2：家族\"))","v":" 1：本人　  2：家族　　数字入力　または　選択"},{"$f":"B27","v":0}]
["負担割合",null," 1～３ 　数字入力 または 選択"]
["医療証負担者番号",null,null,"撮影部位","腰椎　＋　大腿骨",null,{"$f":"IFERROR(IF(FIND(1,$B$28,1),\"☑　1: みぎ\",\"□　1: みぎ\"),\"□　1: みぎ\")","v":"□　1: みぎ"}]
["医療証受給者番号",null,null,null,null,null,{"$f":"IFERROR(IF(FIND(2,$B$28,1),\"☑　2: ひだり\",\"□　2: ひだり\"),\"□　2: ひだり\")","v":"□　2: ひだり"}]
["臨床診断"]
["検査目的 1行目",null,null,"注意事項",{"$f":"A29","v":"妊娠可能性"},{"$f":"IF(B29=\"\",\"有り・なし\",IF(OR(B29={1,\"有り\"}),\"有り　　　\",\"　　　なし\"))","v":"有り・なし"}]
["2行目"]
["3行目",null,null,0]
["大腿骨 左右",null,"1：みぎ　  2：ひだり　　数字入力　または　選択",0]
["妊娠可能性",null,{"$f":"IF(B29=\"\",\"1：有り　  2：なし　　　数字入力　または　選択\",IF(OR(B29={1,\"有り\"}),\"有り\",\"なし\"))","v":"1：有り　  2：なし　　　数字入力　または　選択"},0]
[null,null,{"$f":"PHONETIC($B$6)","v":""}]
[{"$f":"IFERROR(VLOOKUP($B$12,郵便番号!$A$1:$B$5416,2,FALSE),\"\")","v":""}]
[]
[null,{"$f":"IFERROR(VLOOKUP($B$2,設定リスト!A32:B57,2,FALSE),\"\")","v":""}]
[]
[]
[]
[null,{"$f":"PHONETIC($B$6)","v":""}]
[]
[]
[]
[]
[null,null,null,"当院記入欄"]
[null,{"$f":"$A$31","v":""}]
[null,null,null,"※紹介元のご施設様へのお願い",null,null,null,null,null,null,"患者様用"]
[null,null,null,"患者様へお渡しいただきますようお願い申し上げます。"]
[]
[null,null,null,"検査当日のご案内・注意事項　【患者様用】"]
[null,null,null,"患者氏名",{"$f":"IF($B$6=\"\",\"\",$B$6)","v":""},null,null,"様"]
[null,null,null,"予定日時",{"$f":"IF($B$4=\"\",\"　　年　　　月　　　日　　　曜日\",$B$4)","v":"　　年　　　月　　　日　　　曜日"},null,null,null,null,{"$f":"IF($B$5=\"\",\":\",$B$5)","v":":"}]
[null,null,null,null,"受診当日は 1階　新患（①初診）窓口にお越しください。"]
[null,null,null,null,"混雑状況によって、検査開始が前後したり、順番を変更したりする場合がございます。"]
[]
[null,null,null,"●予定されている検査"]
[null,null,null,null,null,"☑　骨密度"]
[]
[null,null,null,"●来院時の持ち物"]
[null,null,null,"☑　すべての方　","1) 保険証       2) 当院診察券（お持ちの方のみ)       3) 紹介書類一式"]
[]
[]
[null,null,null,"●当日の食事、飲水"]
[null,null,null,"☑　食事、飲水の制限はありません。"]
[]
[]
[null,null,null,"●飲み薬"]
[null,null,null,"☑　飲み薬はいつものように服用してください。"]
[]
[]
[]
[]
[]
[]
[]
[]
[]
[]
[]
[]
[]
[]
[]
[]
[]
[]
[]
[]
[]
[]
[]
[]
[]
[]
[null,null,null,"都合が悪くなった場合は紹介元ご施設様へご連絡ください。",null,null,null,{"$f":"E3","v":0}]
[null,null,null,"検査に関するご質問等は当院までご連絡ください。　　",null,null,null,null,null,null,"柏崎総合医療センター　代表) 0257 - 23 - 2165"]

{"sheet":"郵便番号","index":1,"n_rows":5416,"n_cols":2,"rows_kept":5416,"cut":false,"hidden":true,"merged":[]}
[3892261,"新潟県 妙高市 樽本（１１０１番地）"]
[9400001,"新潟県 長岡市 川辺町"]
[9400002,"新潟県 長岡市 十二潟町"]
[9400003,"新潟県 長岡市 高見"]
[9400004,"新潟県 長岡市 高見町"]
[9400006,"新潟県 長岡市 東高見"]
[9400007,"新潟県 長岡市 黒津町"]
[9400008,"新潟県 長岡市 天神町"]
[9400011,"新潟県 長岡市 下々条町"]
[9400012,"新潟県 長岡市 下々条"]
[9400013,"新潟県 長岡市 原町"]
[9400014,"新潟県 長岡市 北園町"]
[9400015,"新潟県 長岡市 寿"]
[9400016,"新潟県 長岡市 宝"]
[9400017,"新潟県 長岡市 中瀬"]
[9400021,"新潟県 長岡市 城岡"]
[9400022,"新潟県 長岡市 東新町"]
[9400023,"新潟県 長岡市 新町"]
[9400024,"新潟県 長岡市 西新町"]
[9400025,"新潟県 長岡市 泉"]
[9400026,"新潟県 長岡市 石内"]
[9400027,"新潟県 長岡市 西蔵王"]
[9400028,"新潟県 長岡市 蔵王"]
[9400029,"新潟県 長岡市 東蔵王"]
[9400031,"新潟県 長岡市 地蔵"]
[9400032,"新潟県 長岡市 干場"]
[9400033,"新潟県 長岡市 今朝白"]
[9400034,"新潟県 長岡市 福住"]
[9400035,"新潟県 長岡市 東神田"]
[9400036,"新潟県 長岡市 愛宕"]
[9400037,"新潟県 長岡市 東栄"]
[9400038,"新潟県 長岡市 琴平"]
[9400041,"新潟県 長岡市 学校町"]
[9400042,"新潟県 長岡市 前田"]
[9400043,"新潟県 長岡市 土合"]
[9400044,"新潟県 長岡市 住吉"]
[9400045,"新潟県 長岡市 金房"]
[9400046,"新潟県 長岡市 四郎丸"]
[9400047,"新潟県 長岡市 弓町"]
[9400048,"新潟県 長岡市 台町"]
[9400051,"新潟県 長岡市 西神田町"]
[9400052,"新潟県 長岡市 神田町"]
[9400053,"新潟県 長岡市 長町"]
[9400054,"新潟県 長岡市 稽古町"]
[9400055,"新潟県 長岡市 袋町"]
[9400056,"新潟県 長岡市 呉服町"]
[9400061,"新潟県 長岡市 城内町"]
[9400062,"新潟県 長岡市 大手通"]
[9400063,"新潟県 長岡市 旭町"]
[9400064,"新潟県 長岡市 殿町"]
[9400065,"新潟県 長岡市 坂之上町"]
[9400066,"新潟県 長岡市 東坂之上町"]
[9400067,"新潟県 長岡市 関東町"]
[9400071,"新潟県 長岡市 表町"]
[9400072,"新潟県 長岡市 柳原町"]
[9400073,"新潟県 長岡市 船江町"]
[9400074,"新潟県 長岡市 上田町"]
[9400075,"新潟県 長岡市 渡里町"]
[9400076,"新潟県 長岡市 本町"]
[9400081,"新潟県 長岡市 南町"]
[9400082,"新潟県 長岡市 千歳"]
[9400083,"新潟県 長岡市 宮原"]
[9400084,"新潟県 長岡市 幸町"]
[9400085,"新潟県 長岡市 草生津"]
[9400086,"新潟県 長岡市 西千手"]
[9400087,"新潟県 長岡市 千手"]
[9400088,"新潟県 長岡市 柏町"]
[9400091,"新潟県 長岡市 松葉"]
[9400092,"新潟県 長岡市 昭和"]
[9400093,"新潟県 長岡市 水道町"]
[9400094,"新潟県 長岡市 中島"]
[9400095,"新潟県 長岡市 日赤町"]
[9400096,"新潟県 長岡市 春日"]
[9400097,"新潟県 長岡市 山田"]
[9400098,"新潟県 長岡市 信濃"]
[9400101,"新潟県 長岡市 文納"]
[9400102,"新潟県 長岡市 人面"]
[9400103,"新潟県 長岡市 二ツ郷屋"]
[9400104,"新潟県 長岡市 山屋"]
[9400105,"新潟県 長岡市 明戸"]
[9400106,"新潟県 長岡市 水沢"]
[9400111,"新潟県 長岡市 下塩"]
[9400112,"新潟県 長岡市 二日町"]
[9400113,"新潟県 長岡市 熊袋"]
[9400114,"新潟県 長岡市 山口"]
[9400115,"新潟県 長岡市 下樫出"]
[9400116,"新潟県 長岡市 上樫出"]
[9400121,"新潟県 長岡市 九川"]
[9400122,"新潟県 長岡市 塩中"]
[9400123,"新潟県 長岡市 梅野俣"]
[9400124,"新潟県 長岡市 平中野俣"]
[9400125,"新潟県 長岡市 葎谷"]
[9400126,"新潟県 長岡市 山葵谷"]
[9400127,"新潟県 長岡市 滝之口"]
[9400128,"新潟県 長岡市 上塩"]
[9400129,"新潟県 長岡市 塩新町"]
[9400131,"新潟県 長岡市 吉水"]
[9400132,"新潟県 長岡市 栃尾原"]
[9400133,"新潟県 長岡市 巻渕"]
[9400134,"新潟県 長岡市 栃尾原町"]
[9400135,"新潟県 長岡市 金沢"]
[9400136,"新潟県 長岡市 東が丘"]
[9400137,"新潟県 長岡市 平"]
[9400141,"新潟県 長岡市 栃尾島田"]
[9400142,"新潟県 長岡市 本所"]
[9400143,"新潟県 長岡市 入塩川"]
[9400144,"新潟県 長岡市 菅畑"]
[9400145,"新潟県 長岡市 栃堀"]
[9400146,"新潟県 長岡市 小向"]
[9400147,"新潟県 長岡市 赤谷"]
[9400148,"新潟県 長岡市 大川戸"]
[9400149,"新潟県 長岡市 栃倉"]
[9400151,"新潟県 長岡市 吹谷"]
[9400152,"新潟県 長岡市 来伝"]
[9400153,"新潟県 長岡市 寒沢"]
[9400154,"新潟県 長岡市 松尾"]
[9400155,"新潟県 長岡市 栗山沢"]
[9400201,"新潟県 長岡市 鴉ケ島"]
[9400202,"新潟県 長岡市 栃尾岩野外新田"]
[9400203,"新潟県 長岡市 楡原"]
[9400204,"新潟県 長岡市 新栄町"]
[9400205,"新潟県 長岡市 栄町"]
[9400211,"新潟県 長岡市 小貫"]
[9400212,"新潟県 長岡市 土ケ谷"]
[9400213,"新潟県 長岡市 栃尾山田町"]
[9400214,"新潟県 長岡市 栃尾山田"]
[9400215,"新潟県 長岡市 栃尾町"]
[9400216,"新潟県 長岡市 栃尾新町"]
[9400217,"新潟県 長岡市 栃尾大町"]
[9400218,"新潟県 長岡市 栃尾表町"]
[9400221,"新潟県 長岡市 金町"]
[9400222,"新潟県 長岡市 中央公園"]
[9400223,"新潟県 長岡市 栃尾本町"]
[9400224,"新潟県 長岡市 東町"]
[9400225,"新潟県 長岡市 仲子町"]
[9400226,"新潟県 長岡市 滝の下町"]
[9400227,"新潟県 長岡市 谷内"]
[9400231,"新潟県 長岡市 栃尾旭町"]
[9400232,"新潟県 長岡市 天下島"]
[9400233,"新潟県 長岡市 栃尾宮沢"]
[9400234,"新潟県 長岡市 栃尾泉"]
[9400235,"新潟県 長岡市 栃尾大野"]
[9400236,"新潟県 長岡市 栃尾大野町"]
[9400237,"新潟県 長岡市 上の原町"]
[9400241,"新潟県 長岡市 北荷頃"]
[9400242,"新潟県 長岡市 一之貝"]
[9400243,"新潟県 長岡市 軽井沢"]
[9400244,"新潟県 長岡市 比礼"]
[9400245,"新潟県 長岡市 本津川"]
[9400251,"新潟県 長岡市 田之口"]
[9400252,"新潟県 長岡市 西野俣"]
[9400253,"新潟県 長岡市 中"]
[9400254,"新潟県 長岡市 木山沢"]
[9400255,"新潟県 長岡市 東中野俣"]
[9400256,"新潟県 長岡市 西中野俣"]
[9400257,"新潟県 長岡市 森上"]
[9400258,"新潟県 長岡市 半蔵金"]
[9400801,"新潟県 長岡市 亀崎町"]
[9400802,"新潟県 長岡市 桂町"]
[9400803,"新潟県 長岡市 加津保町"]
[9400804,"新潟県 長岡市 水穴町"]
[9400805,"新潟県 長岡市 浦瀬町"]
[9400806,"新潟県 長岡市 麻生田町"]
[9400811,"新潟県 長岡市 宮路町"]
[9400812,"新潟県 長岡市 乙吉町"]
[9400813,"新潟県 長岡市 川中"]
[9400814,"新潟県 長岡市 成願寺町"]
[9400816,"新潟県 長岡市 東片貝町"]
[9400817,"新潟県 長岡市 西片貝町"]
[9400819,"新潟県 長岡市 千代栄町"]
[9400821,"新潟県 長岡市 栖吉町"]
[9400822,"新潟県 長岡市 柿町"]
[9400824,"新潟県 長岡市 高町"]
[9400825,"新潟県 長岡市 高畑町"]
[9400826,"新潟県 長岡市 長倉町"]
[9400827,"新潟県 長岡市 悠久町"]
[9400828,"新潟県 長岡市 御山町"]
[9400829,"新潟県 長岡市 長倉"]
[9400831,"新潟県 長岡市 上条町"]
[9400832,"新潟県 長岡市 曙"]
[9400833,"新潟県 長岡市 笹崎"]
[9400834,"新潟県 長岡市 末広"]
[9400835,"新潟県 長岡市 錦"]
[9400836,"新潟県 長岡市 豊田町"]
[9400840,"新潟県 長岡市 旭岡"]
[9400841,"新潟県 長岡市 花園南"]
[9400842,"新潟県 長岡市 鉢伏町"]
[9400843,"新潟県 長岡市 東大町"]
[9400844,"新潟県 長岡市 大町"]
[9400845,"新潟県 長岡市 花園"]
[9400846,"新潟県 長岡市 花園東"]
[9400847,"新潟県 長岡市 土合町"]
[9400848,"新潟県 長岡市 長倉南町"]
[9400849,"新潟県 長岡市 長倉西町"]
[9400851,"新潟県 長岡市 若草町"]
[9400852,"新潟県 長岡市 中貫町"]
[9400853,"新潟県 長岡市 中沢"]
[9400854,"新潟県 長岡市 中沢町"]
[9400856,"新潟県 長岡市 美沢"]
[9400857,"新潟県 長岡市 沖田"]
[9400861,"新潟県 長岡市 川崎町"]
[9400864,"新潟県 長岡市 川崎"]
[9400865,"新潟県 長岡市 四郎丸町"]
[9400866,"新潟県 長岡市 美園"]
[9400867,"新潟県 長岡市 豊"]
[9400868,"新潟県 長岡市 堀金"]
[9400871,"新潟県 長岡市 北陽"]
[9400872,"新潟県 長岡市 稲葉町"]
[9400873,"新潟県 長岡市 永田町"]
[9400874,"新潟県 長岡市 永田"]
[9400875,"新潟県 長岡市 新保"]
[9400876,"新潟県 長岡市 新保町"]
[9400877,"新潟県 長岡市 稲保"]
[9400878,"新潟県 長岡市 稲保南"]
[9400881,"新潟県 長岡市 富島町"]
[9400882,"新潟県 長岡市 宮下町"]
[9400883,"新潟県 長岡市 小曽根町"]
[9400884,"新潟県 長岡市 亀貝町"]
[9400891,"新潟県 長岡市 四ツ屋町"]
[9400892,"新潟県 長岡市 百束町"]
[9400893,"新潟県 長岡市 福井町"]
[9400894,"新潟県 長岡市 七軒町"]
[9400895,"新潟県 長岡市 大黒町"]
[9400896,"新潟県 長岡市 福島町"]
[9400897,"新潟県 長岡市 新組町"]
[9400898,"新潟県 長岡市 新組南町"]
[9401101,"新潟県 長岡市 沢田"]
[9401102,"新潟県 長岡市 東宮内町"]
[9401103,"新潟県 長岡市 曲新町"]
[9401104,"新潟県 長岡市 摂田屋町"]
[9401105,"新潟県 長岡市 摂田屋"]
[9401106,"新潟県 長岡市 宮内"]
[9401111,"新潟県 長岡市 町田町"]
[9401112,"新潟県 長岡市 青木町"]
[9401113,"新潟県 長岡市 鷺巣町"]
[9401114,"新潟県 長岡市 釜沢町"]
[9401115,"新潟県 長岡市 村松町"]
[9401116,"新潟県 長岡市 竹町"]
[9401117,"新潟県 長岡市 横枕町"]
[9401121,"新潟県 長岡市 濁沢町"]
[9401122,"新潟県 長岡市 蓬平町"]
[9401123,"新潟県 長岡市 竹之高地町"]
[9401131,"新潟県 長岡市 十日町"]
[9401132,"新潟県 長岡市 渡沢町"]
[9401133,"新潟県 長岡市 六日市町"]
[9401134,"新潟県 長岡市 妙見町"]
[9401135,"新潟県 長岡市 中潟町"]
[9401136,"新潟県 長岡市 三俵野町"]
[9401137,"新潟県 長岡市 大川原町"]
[9401138,"新潟県 長岡市 滝谷町"]
[9401139,"新潟県 長岡市 高島町"]
[9401140,"新潟県 長岡市 上前島"]
[9401141,"新潟県 長岡市 定明町"]
[9401142,"新潟県 長岡市 豊詰町"]
[9401143,"新潟県 長岡市 片田町"]
[9401144,"新潟県 長岡市 上前島町"]
[9401145,"新潟県 長岡市 青島町"]
[9401146,"新潟県 長岡市 下条町"]
[9401147,"新潟県 長岡市 前島町"]
[9401148,"新潟県 長岡市 青山町"]
[9401149,"新潟県 長岡市 青山新町"]
[9401151,"新潟県 長岡市 三和"]
[9401152,"新潟県 長岡市 三和町"]
[9401153,"新潟県 長岡市 要町"]
[9401154,"新潟県 長岡市 宮栄"]
[9401155,"新潟県 長岡市 宮内町"]
[9401161,"新潟県 長岡市 左近"]
[9401161,"新潟県 長岡市 左近町"]
[9401162,"新潟県 長岡市 西宮内"]
[9401163,"新潟県 長岡市 平島"]
[9401163,"新潟県 長岡市 平島町"]
[9401164,"新潟県 長岡市 南陽"]
[9401165,"新潟県 長岡市 水梨町"]
[9401166,"新潟県 長岡市 今井"]
[9401167,"新潟県 長岡市 大宮町"]
[9401171,"新潟県 長岡市 岩野（仲島）"]
[9401172,"新潟県 長岡市 釜ケ島（土手畑・藤場）"]
[9402001,"新潟県 長岡市 槇下町"]
[9402002,"新潟県 長岡市 槇山町"]
[9402003,"新潟県 長岡市 渡場町"]
[9402004,"新潟県 長岡市 上野町"]
[9402005,"新潟県 長岡市 巻島"]
[9402011,"新潟県 長岡市 藤沢"]
[9402012,"新潟県 長岡市 荻野"]
[9402013,"新潟県 長岡市 下柳"]
[9402014,"新潟県 長岡市 堤町"]
[9402015,"新潟県 長岡市 江陽"]
[9402021,"新潟県 長岡市 宮関"]
[9402022,"新潟県 長岡市 鉄工町"]
[9402023,"新潟県 長岡市 蓮潟"]
[9402024,"新潟県 長岡市 堺町"]
[9402025,"新潟県 長岡市 高瀬町"]
[9402026,"新潟県 長岡市 堺東町"]
[9402031,"新潟県 長岡市 宝地町"]
[9402032,"新潟県 長岡市 石動町"]
[9402033,"新潟県 長岡市 上除町"]
[9402034,"新潟県 長岡市 上除町西"]
[9402035,"新潟県 長岡市 関原町"]
[9402036,"新潟県 長岡市 五反田町"]
[9402037,"新潟県 長岡市 関原西町"]
[9402038,"新潟県 長岡市 関原東町"]
[9402039,"新潟県 長岡市 関原南"]
[9402041,"新潟県 長岡市 白鳥町"]
[9402042,"新潟県 長岡市 宮本町"]
[9402043,"新潟県 長岡市 宮本東方町"]
[9402044,"新潟県 長岡市 宮本堀之内町"]
[9402045,"新潟県 長岡市 西陵町"]
[9402046,"新潟県 長岡市 雲出町"]
[9402051,"新潟県 長岡市 高野町"]
[9402052,"新潟県 長岡市 福戸町"]
[9402053,"新潟県 長岡市 福道町"]
[9402054,"新潟県 長岡市 南新保町"]
[9402055,"新潟県 長岡市 雨池町"]
[9402056,"新潟県 長岡市 王番田町"]
[9402057,"新潟県 長岡市 寺宝町"]
[9402058,"新潟県 長岡市 河根川町"]
[9402059,"新潟県 長岡市 大荒戸町"]
[9402101,"新潟県 長岡市 寺島町"]
[9402102,"新潟県 長岡市 小沢町"]
[9402103,"新潟県 長岡市 古正寺町"]
[9402104,"新潟県 長岡市 大島新町"]
[9402105,"新潟県 長岡市 緑町"]
[9402106,"新潟県 長岡市 古正寺"]
[9402108,"新潟県 長岡市 千秋"]
[9402111,"新潟県 長岡市 三ツ郷屋"]
[9402112,"新潟県 長岡市 大島本町"]
[9402113,"新潟県 長岡市 大山"]
[9402114,"新潟県 長岡市 北山"]
[9402115,"新潟県 長岡市 下山"]
[9402116,"新潟県 長岡市 南七日町"]
[9402117,"新潟県 長岡市 石動南町"]
[9402121,"新潟県 長岡市 喜多町"]
[9402122,"新潟県 長岡市 福山町"]
[9402123,"新潟県 長岡市 七日町"]
[9402124,"新潟県 長岡市 希望が丘"]
[9402125,"新潟県 長岡市 希望が丘南"]
[9402126,"新潟県 長岡市 西津町"]
[9402127,"新潟県 長岡市 新産"]
[9402128,"新潟県 長岡市 新産東町"]
[9402131,"新潟県 長岡市 才津東町"]
[9402132,"新潟県 長岡市 才津南町"]
[9402133,"新潟県 長岡市 才津西町"]
[9402134,"新潟県 長岡市 親沢町"]
[9402135,"新潟県 長岡市 深沢町"]
[9402136,"新潟県 長岡市 上富岡"]
[9402137,"新潟県 長岡市 上富岡町"]
[9402138,"新潟県 長岡市 日越"]
[9402141,"新潟県 長岡市 藤橋"]
[9402142,"新潟県 長岡市 長峰町"]
[9402143,"新潟県 長岡市 高寺町"]
[9402144,"新潟県 長岡市 高頭町"]
[9402145,"新潟県 長岡市 青葉台"]
[9402146,"新潟県 長岡市 大積町"]
[9402147,"新潟県 長岡市 新陽"]
[9402148,"新潟県 長岡市 陽光台"]
[9402151,"新潟県 長岡市 大積灰下町"]
[9402152,"新潟県 長岡市 大積高鳥町"]
[9402153,"新潟県 長岡市 大積千本町"]
[9402154,"新潟県 長岡市 大積田代町"]
[9402155,"新潟県 長岡市 大積熊上町"]
[9402156,"新潟県 長岡市 大積折渡町"]
[9402157,"新潟県 長岡市 大積三島谷町"]
[9402158,"新潟県 長岡市 大積善間町"]
[9402301,"新潟県 長岡市 宮沢"]
[9402302,"新潟県 長岡市 藤川"]
[9402303,"新潟県 長岡市 瓜生"]
[9402304,"新潟県 長岡市 下河根川"]
[9402305,"新潟県 長岡市 大野"]
[9402306,"新潟県 長岡市 脇野町"]
[9402311,"新潟県 長岡市 三島新保"]
[9402312,"新潟県 長岡市 三島中条"]
[9402313,"新潟県 長岡市 吉崎"]
[9402314,"新潟県 長岡市 上岩井"]
[9402315,"新潟県 長岡市 七日市"]
[9402316,"新潟県 長岡市 鳥越"]
[9402321,"新潟県 長岡市 逆谷"]
[9402322,"新潟県 長岡市 気比宮"]
[9402323,"新潟県 長岡市 三島上条"]
[9402324,"新潟県 長岡市 中永"]
[9402325,"新潟県 長岡市 蓮花寺"]
[9402401,"新潟県 長岡市 与板町東与板"]
[9402402,"新潟県 長岡市 与板町与板"]
[9402403,"新潟県 長岡市 与板町本与板"]
[9402404,"新潟県 長岡市 与板町馬越"]
[9402405,"新潟県 長岡市 与板町岩方"]
[9402406,"新潟県 長岡市 与板町江西"]
[9402407,"新潟県 長岡市 与板町城山"]
[9402411,"新潟県 長岡市 与板町蔦都"]
[9402412,"新潟県 長岡市 与板町広野"]
[9402413,"新潟県 長岡市 与板町吉津"]
[9402414,"新潟県 長岡市 与板町中田"]
[9402415,"新潟県 長岡市 与板町南中"]
[9402416,"新潟県 長岡市 与板町槇原"]
[9402417,"新潟県 長岡市 与板町山沢"]
[9402461,"新潟県 長岡市 脇川新田町（その他）"]
[9402462,"新潟県 長岡市 李崎町"]
[9402463,"新潟県 長岡市 川袋町"]
[9402464,"新潟県 長岡市 新開町"]
[9402465,"新潟県 長岡市 成沢町"]
[9402471,"新潟県 長岡市 上柳町"]
{"$rows_left_out":5017}
{"sheet":"設定リスト","index":2,"n_rows":245,"n_cols":5,"rows_kept":245,"cut":false,"hidden":false,"merged":[]}
["紹介元医療機関",{"$f":"VLOOKUP(骨密度!$B$2,設定リスト!A2:B27,2,FALSE)","v":{"$error":"#N/A"}},"予約枠","予約日","Holiday"]
["石井整形外科","石井　卓",null,{"$f":"WORKDAY(TODAY(),ROW()+1,Holiday)","v":"2024-12-06"},"2021-11-03"]
["五十川医院","五十川　修","15:00:00",{"$f":"WORKDAY(D2,1,Holiday)","v":"2024-12-09"},"2021-11-23"]
["稲田医院","稲田　勢介","15:30:00","2024-12-10","2021-12-31"]
["内山整形外科医院","内山　徹","16:00:00","2024-12-11","2022-01-01"]
["柏崎厚生病院","吉浜　淳",null,"2024-12-12","2022-01-02"]
["刈羽診療所","佐藤　一明",null,"2024-12-13","2022-01-03"]
["北村医院","北村　哲也",null,"2024-12-16","2022-01-10"]
["北条診療所",null,null,"2024-12-17","2022-02-11"]
["木村内科循環器科医院","木村　道夫",null,"2024-12-18","2022-02-23"]
["佐藤医院","佐藤　俊大",null,"2024-12-19","2022-03-21"]
["さとう内科クリニック","佐藤　高久",null,"2024-12-20","2022-04-29"]
["杉本医院","杉本　不二雄",null,"2024-12-23","2022-05-03"]
["高木医院","高木　秋夫",null,"2024-12-24","2022-05-04"]
["高橋医院","高橋　章",null,"2024-12-25","2022-05-05"]
["高柳診療所","登坂　尚志",null,"2024-12-26","2022-07-18"]
["谷根診療所",null,null,"2024-12-27","2022-08-11"]
["東京電力ホールディングス（株）\n柏崎刈羽原子力発電所診療所","小野寺　周",null,"2024-12-30","2022-09-19"]
["中沢消化器内科医院","中沢　俊郎",null,"2025-01-06","2022-10-10"]
["のざわ内科医院","能澤　明宏",null,"2025-01-07","2022-11-03"]
["野田診療所","三浦　公一郎",null,"2025-01-08","2022-11-23"]
["平野内科医院","平野　徹",null,"2025-01-09","2022-12-31"]
["本田医院","本田　茂",null,"2025-01-10","2023-01-01"]
["本間内科医院","本間　保",null,"2025-01-14","2023-01-02"]
["宮尾医院","田中　康一",null,"2025-01-15","2023-01-03"]
["山田医院","山田　潔",null,"2025-01-16","2023-01-09"]
["横田整形外科医院","横田　文彦",null,"2025-01-17","2023-02-11"]
[{"$f":"COUNTA(A2:A27)","v":26},null,null,"2025-01-20","2023-02-23"]
[null,null,null,"2025-01-21","2023-04-29"]
[null,null,null,"2025-01-22","2023-05-03"]
[null,null,null,"2025-01-23","2023-05-04"]
[null,null,null,"2025-01-24","2023-05-05"]
[null,null,null,"2025-01-27","2023-07-17"]
[null,null,null,"2025-01-28","2023-08-11"]
[null,null,null,"2025-01-29","2023-09-18"]
[null,null,null,"2025-01-30","2023-08-31"]
[null,null,null,"2025-01-31","2023-10-09"]
[null,null,null,"2025-02-03","2023-11-03"]
[null,null,null,"2025-02-04","2023-11-23"]
[null,null,null,"2025-02-05","2023-12-31"]
[null,null,null,"2025-02-06","2024-01-01"]
[null,null,null,"2025-02-07","2024-01-02"]
[null,null,null,"2025-02-10","2024-01-03"]
[null,null,null,"2025-02-12","2024-01-08"]
[null,null,null,"2025-02-13","2024-02-12"]
[null,null,null,"2025-02-14","2024-02-23"]
[null,null,null,"2025-02-17","2024-04-29"]
[null,null,null,"2025-02-18","2024-05-03"]
[null,null,null,null,"2024-05-04"]
[null,null,null,null,"2024-05-06"]
[null,null,null,null,"2024-07-15"]
[null,null,null,null,"2024-08-12"]
[null,null,null,null,"2024-09-16"]
[null,null,null,null,"2024-10-14"]
[null,null,null,null,"2024-11-04"]
[null,null,null,null,"2024-11-23"]
[null,null,null,null,"2024-12-31"]
[null,null,null,null,"2025-01-01"]
[null,null,null,null,"2025-01-02"]
[null,null,null,null,"2025-01-03"]
[null,null,null,null,"2025-01-13"]
[null,null,null,null,"2025-02-11"]
[null,null,null,null,"2025-02-24"]
[null,null,null,null,"2025-04-29"]
[null,null,null,null,"2025-05-03"]
[null,null,null,null,"2025-05-06"]
[null,null,null,null,"2025-05-05"]
[null,null,null,null,"2025-07-21"]
[null,null,null,null,"2025-08-11"]
[null,null,null,null,"2025-09-15"]
[null,null,null,null,"2025-10-13"]
[null,null,null,null,"2025-11-03"]
[null,null,null,null,"2025-11-24"]
[null,null,null,null,"2025-12-31"]
[null,null,null,null,"2026-01-01"]
[null,null,null,null,"2026-01-02"]
[null,null,null,null,"2026-01-03"]
[null,null,null,null,"2026-01-12"]
[null,null,null,null,"2026-02-11"]
[null,null,null,null,"2026-02-23"]
[null,null,null,null,"2026-04-29"]
[null,null,null,null,"2026-05-06"]
[null,null,null,null,"2026-05-04"]
[null,null,null,null,"2026-05-05"]
[null,null,null,null,"2026-07-20"]
[null,null,null,null,"2026-08-11"]
[null,null,null,null,"2026-09-21"]
[null,null,null,null,"2026-10-12"]
[null,null,null,null,"2026-11-03"]
[null,null,null,null,"2026-11-23"]
[null,null,null,null,"2026-12-31"]
[null,null,null,null,"2027-01-01"]
[null,null,null,null,"2027-01-02"]
[null,null,null,null,"2027-01-03"]
[null,null,null,null,"2027-01-11"]
[null,null,null,null,"2027-02-11"]
[null,null,null,null,"2027-02-23"]
[null,null,null,null,"2027-04-29"]
[null,null,null,null,"2027-05-03"]
[null,null,null,null,"2027-05-04"]
[null,null,null,null,"2027-05-05"]
[null,null,null,null,"2027-07-19"]
[null,null,null,null,"2027-08-11"]
[null,null,null,null,"2027-09-20"]
[null,null,null,null,"2027-10-11"]
[null,null,null,null,"2027-11-03"]
[null,null,null,null,"2027-11-23"]
[null,null,null,null,"2027-12-31"]
[null,null,null,null,"2028-01-01"]
[null,null,null,null,"2028-01-02"]
[null,null,null,null,"2028-01-03"]
[null,null,null,null,"2028-01-10"]
[null,null,null,null,"2028-02-11"]
[null,null,null,null,"2028-02-23"]
[null,null,null,null,"2028-04-29"]
[null,null,null,null,"2028-05-03"]
[null,null,null,null,"2028-05-04"]
[null,null,null,null,"2028-05-05"]
[null,null,null,null,"2028-07-17"]
[null,null,null,null,"2028-08-11"]
[null,null,null,null,"2028-09-18"]
[null,null,null,null,"2028-10-09"]
[null,null,null,null,"2028-11-03"]
[null,null,null,null,"2028-11-23"]
[null,null,null,null,"2028-12-31"]
[null,null,null,null,"2029-01-01"]
[null,null,null,null,"2029-01-02"]
[null,null,null,null,"2029-01-03"]
[null,null,null,null,"2029-01-08"]
[null,null,null,null,"2029-02-12"]
[null,null,null,null,"2029-02-23"]
[null,null,null,null,"2029-04-30"]
[null,null,null,null,"2029-05-03"]
[null,null,null,null,"2029-05-04"]
[null,null,null,null,"2029-05-05"]
[null,null,null,null,"2029-07-16"]
[null,null,null,null,"2029-08-11"]
[null,null,null,null,"2029-09-17"]
[null,null,null,null,"2029-10-08"]
[null,null,null,null,"2029-11-03"]
[null,null,null,null,"2029-11-23"]
[null,null,null,null,"2029-12-31"]
[null,null,null,null,"2030-01-01"]
[null,null,null,null,"2030-01-02"]
[null,null,null,null,"2030-01-03"]
[null,null,null,null,"2030-01-14"]
[null,null,null,null,"2030-02-11"]
[null,null,null,null,"2030-02-23"]
[null,null,null,null,"2030-04-29"]
[null,null,null,null,"2030-05-03"]
[null,null,null,null,"2030-05-04"]
[null,null,null,null,"2030-05-06"]
[null,null,null,null,"2030-07-15"]
[null,null,null,null,"2030-08-12"]
[null,null,null,null,"2030-09-16"]
[null,null,null,null,"2030-10-14"]
[null,null,null,null,"2030-11-04"]
[null,null,null,null,"2030-11-23"]
[null,null,null,null,"2030-12-31"]
[null,null,null,null,"2031-01-01"]
[null,null,null,null,"2031-01-02"]
[null,null,null,null,"2031-01-03"]
[null,null,null,null,"2031-01-13"]
[null,null,null,null,"2031-02-11"]
[null,null,null,null,"2031-02-24"]
[null,null,null,null,"2031-04-29"]
[null,null,null,null,"2031-05-03"]
[null,null,null,null,"2031-05-06"]
[null,null,null,null,"2031-05-05"]
[null,null,null,null,"2031-07-21"]
[null,null,null,null,"2031-08-11"]
[null,null,null,null,"2031-09-15"]
[null,null,null,null,"2031-09-01"]
[null,null,null,null,"2031-10-13"]
[null,null,null,null,"2031-11-03"]
[null,null,null,null,"2031-11-24"]
[null,null,null,null,"2031-12-31"]
[null,null,null,null,"2032-01-01"]
[null,null,null,null,"2032-01-02"]
[null,null,null,null,"2032-01-03"]
[null,null,null,null,"2032-01-12"]
[null,null,null,null,"2032-02-11"]
[null,null,null,null,"2032-02-23"]
[null,null,null,null,"2032-04-29"]
[null,null,null,null,"2032-05-03"]
[null,null,null,null,"2032-05-04"]
[null,null,null,null,"2032-05-05"]
[null,null,null,null,"2032-07-19"]
[null,null,null,null,"2032-08-11"]
[null,null,null,null,"2032-09-20"]
[null,null,null,null,"2032-10-11"]
[null,null,null,null,"2032-11-03"]
[null,null,null,null,"2032-11-23"]
[null,null,null,null,"2032-12-31"]
[null,null,null,null,"2033-01-01"]
[null,null,null,null,"2033-01-02"]
[null,null,null,null,"2033-01-03"]
[null,null,null,null,"2033-01-10"]
[null,null,null,null,"2033-02-11"]
[null,null,null,null,"2033-02-23"]
[null,null,null,null,"2033-04-29"]
[null,null,null,null,"2033-05-03"]
[null,null,null,null,"2033-05-04"]
[null,null,null,null,"2033-05-05"]
[null,null,null,null,"2033-07-18"]
[null,null,null,null,"2033-08-11"]
[null,null,null,null,"2033-09-19"]
[null,null,null,null,"2033-10-10"]
[null,null,null,null,"2033-11-03"]
[null,null,null,null,"2033-11-23"]
[null,null,null,null,"2033-12-31"]
[null,null,null,null,"2034-01-01"]
[null,null,null,null,"2034-01-02"]
[null,null,null,null,"2034-01-03"]
[null,null,null,null,"2034-01-09"]
[null,null,null,null,"2034-02-11"]
[null,null,null,null,"2034-02-23"]
[null,null,null,null,"2034-04-29"]
[null,null,null,null,"2034-05-03"]
[null,null,null,null,"2034-05-04"]
[null,null,null,null,"2034-05-05"]
[null,null,null,null,"2034-07-17"]
[null,null,null,null,"2034-08-11"]
[null,null,null,null,"2034-09-18"]
[null,null,null,null,"2034-10-09"]
[null,null,null,null,"2034-11-03"]
[null,null,null,null,"2034-11-23"]
[null,null,null,null,"2034-12-31"]
[null,null,null,null,"2035-01-01"]
[null,null,null,null,"2035-01-02"]
[null,null,null,null,"2035-01-03"]
[null,null,null,null,"2035-01-08"]
[null,null,null,null,"2035-02-12"]
[null,null,null,null,"2035-02-23"]
[null,null,null,null,"2035-04-30"]
[null,null,null,null,"2035-05-03"]
[null,null,null,null,"2035-05-04"]
[null,null,null,null,"2035-05-05"]
[null,null,null,null,"2035-07-16"]
[null,null,null,null,"2035-08-11"]
[null,null,null,null,"2035-09-17"]
[null,null,null,null,"2035-10-08"]
[null,null,null,null,"2035-11-03"]
[null,null,null,null,"2035-11-23"]
[null,null,null,null,"2035-12-31"]